Target
Tegument protein VP16
Ligand
BDBM87282
Substrate
Meas. Tech.
Counterscreen for inhibitors of the Steroid Receptor Coactivator 3 (SRC3; NCOA3)
IC50
10165±n/a nM
Citation
 PubChem, PC Counterscreen for inhibitors of the Steroid Receptor Coactivator 3 (SRC3; NCOA3): Luminescence-based cell-based high throughput dose response assay to identify inhibitors of the Herpes Virus Virion Protein 16 (VP16) PubChem Bioassay (2012)[AID] 
Target
Name:
Tegument protein VP16
Synonyms:
Alpha trans-inducing protein (VP16) transactivating tegument protein VP16
Type:
PROTEIN
Mol. Mass.:
54325.13
Organism:
Human herpesvirus 1 (strain 17) (HHV-1) (Human herpes simplex virus1)
Description:
EBI_100271
Residue:
490
  
Inhibitor
Name:
BDBM87282
Synonyms:
5-bromanyl-N-[4-(2-morpholin-4-yl-2-oxidanylidene-ethoxy)phenyl]pyridine-3-carboxamide 5-bromo-N-[4-(2-morpholin-4-yl-2-oxoethoxy)phenyl]pyridine-3-carboxamide 5-bromo-N-{4-[2-(4-morpholinyl)-2-oxoethoxy]phenyl}nicotinamide SMR000229370 | cid_990978
Type:
Small organic molecule
Emp. Form.:
C18H18BrN3O4
Mol. Mass.:
420.257
SMILES:
Brc1cncc(c1)C(=O)Nc1ccc(OCC(=O)N2CCOCC2)cc1
: