Target
Tegument protein VP16
Ligand
BDBM63301
Substrate
Meas. Tech.
Counterscreen for inhibitors of the Steroid Receptor Coactivator 3 (SRC3; NCOA3)
IC50
16209±n/a nM
Citation
 PubChem, PC Counterscreen for inhibitors of the Steroid Receptor Coactivator 3 (SRC3; NCOA3): Luminescence-based cell-based high throughput dose response assay to identify inhibitors of the Herpes Virus Virion Protein 16 (VP16) PubChem Bioassay (2012)[AID] 
Target
Name:
Tegument protein VP16
Synonyms:
Alpha trans-inducing protein (VP16) transactivating tegument protein VP16
Type:
PROTEIN
Mol. Mass.:
54325.13
Organism:
Human herpesvirus 1 (strain 17) (HHV-1) (Human herpes simplex virus1)
Description:
EBI_100271
Residue:
490
  
Inhibitor
Name:
BDBM63301
Synonyms:
1-(2,5-dimethyl-1-phenyl-3-pyrrolyl)-2-[(6-methyl-2-nitro-3-pyridinyl)oxy]ethanone 1-(2,5-dimethyl-1-phenyl-pyrrol-3-yl)-2-[(6-methyl-2-nitro-3-pyridyl)oxy]ethanone MLS000333959 cid_3599481
Type:
Small organic molecule
Emp. Form.:
C20H19N3O4
Mol. Mass.:
365.3826
SMILES:
Cc1cc(C(=O)COc2ccc(C)nc2[N+]([O-])=O)c(C)n1-c1ccccc1
: