Target
Tegument protein VP16
Ligand
BDBM87308
Substrate
Meas. Tech.
Counterscreen for inhibitors of the Steroid Receptor Coactivator 3 (SRC3; NCOA3)
IC50
7500±n/a nM
Citation
 PubChem, PC Counterscreen for inhibitors of the Steroid Receptor Coactivator 3 (SRC3; NCOA3): Luminescence-based cell-based high throughput dose response assay to identify inhibitors of the Herpes Virus Virion Protein 16 (VP16) PubChem Bioassay (2012)[AID] 
Target
Name:
Tegument protein VP16
Synonyms:
Alpha trans-inducing protein (VP16) transactivating tegument protein VP16
Type:
PROTEIN
Mol. Mass.:
54325.13
Organism:
Human herpesvirus 1 (strain 17) (HHV-1) (Human herpes simplex virus1)
Description:
EBI_100271
Residue:
490
  
Inhibitor
Name:
BDBM87308
Synonyms:
4-[4-(1-benzimidazolyl)phenyl]-2-pyrimidinamine 4-[4-(benzimidazol-1-yl)phenyl]pyrimidin-2-amine SMR000336277 cid_1477777
Type:
Small organic molecule
Emp. Form.:
C17H13N5
Mol. Mass.:
287.3186
SMILES:
Nc1nccc(n1)-c1ccc(cc1)-n1cnc2ccccc12
: