Target
Tegument protein VP16
Ligand
BDBM87310
Substrate
Meas. Tech.
Counterscreen for inhibitors of the Steroid Receptor Coactivator 3 (SRC3; NCOA3)
IC50
>11955±n/a nM
Citation
 PubChem, PC Counterscreen for inhibitors of the Steroid Receptor Coactivator 3 (SRC3; NCOA3): Luminescence-based cell-based high throughput dose response assay to identify inhibitors of the Herpes Virus Virion Protein 16 (VP16) PubChem Bioassay (2012)[AID] 
Target
Name:
Tegument protein VP16
Synonyms:
Alpha trans-inducing protein (VP16) transactivating tegument protein VP16
Type:
PROTEIN
Mol. Mass.:
54325.13
Organism:
Human herpesvirus 1 (strain 17) (HHV-1) (Human herpes simplex virus1)
Description:
EBI_100271
Residue:
490
  
Inhibitor
Name:
BDBM87310
Synonyms:
3-(2,3-dihydro-1,4-benzodioxin-6-ylhydrazinylidene)pentane-2,4-dione MLS000770600 cid_2834531
Type:
Small organic molecule
Emp. Form.:
C13H14N2O4
Mol. Mass.:
262.2613
SMILES:
[#6]-[#6](=O)-[#6](=[#7]\[#7]-c1ccc2-[#8]-[#6]-[#6]-[#8]-c2c1)\[#6](-[#6])=O
: