Target
Tegument protein VP16
Ligand
BDBM87321
Substrate
Meas. Tech.
Counterscreen for inhibitors of the Steroid Receptor Coactivator 3 (SRC3; NCOA3)
IC50
9395±n/a nM
Citation
 PubChem, PC Counterscreen for inhibitors of the Steroid Receptor Coactivator 3 (SRC3; NCOA3): Luminescence-based cell-based high throughput dose response assay to identify inhibitors of the Herpes Virus Virion Protein 16 (VP16) PubChem Bioassay (2012)[AID] 
Target
Name:
Tegument protein VP16
Synonyms:
Alpha trans-inducing protein (VP16) transactivating tegument protein VP16
Type:
PROTEIN
Mol. Mass.:
54325.13
Organism:
Human herpesvirus 1 (strain 17) (HHV-1) (Human herpes simplex virus1)
Description:
EBI_100271
Residue:
490
  
Inhibitor
Name:
BDBM87321
Synonyms:
3-Chloro-4-[4-(4-fluoro-benzenesulfonyl)-piperazin-1-yl]-N,N-dimethyl-benzenesulfonamide 3-chloro-4-[4-(4-fluorophenyl)sulfonyl-1-piperazinyl]-N,N-dimethylbenzenesulfonamide 3-chloro-4-[4-(4-fluorophenyl)sulfonylpiperazino]-N,N-dimethyl-benzenesulfonamide SMR000008025 | cid_652727
Type:
Small organic molecule
Emp. Form.:
C18H21ClFN3O4S2
Mol. Mass.:
461.958
SMILES:
CN(C)S(=O)(=O)c1ccc(N2CCN(CC2)S(=O)(=O)c2ccc(F)cc2)c(Cl)c1
: