Target
Tegument protein VP16
Ligand
BDBM47479
Substrate
Meas. Tech.
Counterscreen for inhibitors of the Steroid Receptor Coactivator 3 (SRC3; NCOA3)
IC50
5007±n/a nM
Citation
 PubChem, PC Counterscreen for inhibitors of the Steroid Receptor Coactivator 3 (SRC3; NCOA3): Luminescence-based cell-based high throughput dose response assay to identify inhibitors of the Herpes Virus Virion Protein 16 (VP16) PubChem Bioassay (2012)[AID] 
Target
Name:
Tegument protein VP16
Synonyms:
Alpha trans-inducing protein (VP16) transactivating tegument protein VP16
Type:
PROTEIN
Mol. Mass.:
54325.13
Organism:
Human herpesvirus 1 (strain 17) (HHV-1) (Human herpes simplex virus1)
Description:
EBI_100271
Residue:
490
  
Inhibitor
Name:
BDBM47479
Synonyms:
6-amino-5-[1-(2-fluoro-6-methoxy-phenyl)-2-nitro-ethyl]-1,3-dimethyl-pyrimidine-2,4-quinone 6-amino-5-[1-(2-fluoro-6-methoxyphenyl)-2-nitroethyl]-1,3-dimethylpyrimidine-2,4-dione MLS000861865 cid_2732795
Type:
Small organic molecule
Emp. Form.:
C15H17FN4O5
Mol. Mass.:
352.3177
SMILES:
COc1cccc(F)c1C(C[N+]([O-])=O)c1c(N)n(C)c(=O)n(C)c1=O
: