Target
Tegument protein VP16
Ligand
BDBM87333
Substrate
Meas. Tech.
Counterscreen for inhibitors of the Steroid Receptor Coactivator 3 (SRC3; NCOA3)
IC50
12520±n/a nM
Citation
 PubChem, PC Counterscreen for inhibitors of the Steroid Receptor Coactivator 3 (SRC3; NCOA3): Luminescence-based cell-based high throughput dose response assay to identify inhibitors of the Herpes Virus Virion Protein 16 (VP16) PubChem Bioassay (2012)[AID] 
Target
Name:
Tegument protein VP16
Synonyms:
Alpha trans-inducing protein (VP16) transactivating tegument protein VP16
Type:
PROTEIN
Mol. Mass.:
54325.13
Organism:
Human herpesvirus 1 (strain 17) (HHV-1) (Human herpes simplex virus1)
Description:
EBI_100271
Residue:
490
  
Inhibitor
Name:
BDBM87333
Synonyms:
1-(4-quinazolin-4-ylpiperazin-1-yl)ethanone 1-[4-(4-quinazolinyl)-1-piperazinyl]ethanone MLS001000828 cid_594152
Type:
Small organic molecule
Emp. Form.:
C14H16N4O
Mol. Mass.:
256.303
SMILES:
CC(=O)N1CCN(CC1)c1ncnc2ccccc12
: