Target
Tegument protein VP16
Ligand
BDBM77578
Substrate
Meas. Tech.
Counterscreen for inhibitors of the Steroid Receptor Coactivator 3 (SRC3; NCOA3)
IC50
4420±n/a nM
Citation
 PubChem, PC Counterscreen for inhibitors of the Steroid Receptor Coactivator 3 (SRC3; NCOA3): Luminescence-based cell-based high throughput dose response assay to identify inhibitors of the Herpes Virus Virion Protein 16 (VP16) PubChem Bioassay (2012)[AID] 
Target
Name:
Tegument protein VP16
Synonyms:
Alpha trans-inducing protein (VP16) transactivating tegument protein VP16
Type:
PROTEIN
Mol. Mass.:
54325.13
Organism:
Human herpesvirus 1 (strain 17) (HHV-1) (Human herpes simplex virus1)
Description:
EBI_100271
Residue:
490
  
Inhibitor
Name:
BDBM77578
Synonyms:
MLS001211345 N-[(2,4-dichlorophenyl)-(8-hydroxy-7-quinolinyl)methyl]butanamide N-[(2,4-dichlorophenyl)-(8-hydroxyquinolin-7-yl)methyl]butanamide SMR000517131 | cid_2921215
Type:
Small organic molecule
Emp. Form.:
C20H18Cl2N2O2
Mol. Mass.:
389.275
SMILES:
CCCC(=O)NC(c1ccc(Cl)cc1Cl)c1ccc2cccnc2c1O
: