Target
Tegument protein VP16
Ligand
BDBM59559
Substrate
Meas. Tech.
Counterscreen for inhibitors of the Steroid Receptor Coactivator 3 (SRC3; NCOA3)
IC50
30582±n/a nM
Citation
 PubChem, PC Counterscreen for inhibitors of the Steroid Receptor Coactivator 3 (SRC3; NCOA3): Luminescence-based cell-based high throughput dose response assay to identify inhibitors of the Herpes Virus Virion Protein 16 (VP16) PubChem Bioassay (2012)[AID] 
Target
Name:
Tegument protein VP16
Synonyms:
Alpha trans-inducing protein (VP16) transactivating tegument protein VP16
Type:
PROTEIN
Mol. Mass.:
54325.13
Organism:
Human herpesvirus 1 (strain 17) (HHV-1) (Human herpes simplex virus1)
Description:
EBI_100271
Residue:
490
  
Inhibitor
Name:
BDBM59559
Synonyms:
2-[2-[3-(2-ethoxyphenyl)-4-oxidanylidene-quinazolin-2-yl]sulfanylethanoylamino]benzoic acid 2-[[2-[3-(2-ethoxyphenyl)-4-oxoquinazolin-2-yl]sulfanylacetyl]amino]benzoic acid MLS001179719 cid_4855101
Type:
Small organic molecule
Emp. Form.:
C25H21N3O5S
Mol. Mass.:
475.516
SMILES:
CCOc1ccccc1-n1c(SCC(=O)Nc2ccccc2C(O)=O)nc2ccccc2c1=O
: