Target
Tegument protein VP16
Ligand
BDBM87341
Substrate
Meas. Tech.
Counterscreen for inhibitors of the Steroid Receptor Coactivator 3 (SRC3; NCOA3)
IC50
23887±n/a nM
Citation
 PubChem, PC Counterscreen for inhibitors of the Steroid Receptor Coactivator 3 (SRC3; NCOA3): Luminescence-based cell-based high throughput dose response assay to identify inhibitors of the Herpes Virus Virion Protein 16 (VP16) PubChem Bioassay (2012)[AID] 
Target
Name:
Tegument protein VP16
Synonyms:
Alpha trans-inducing protein (VP16) transactivating tegument protein VP16
Type:
PROTEIN
Mol. Mass.:
54325.13
Organism:
Human herpesvirus 1 (strain 17) (HHV-1) (Human herpes simplex virus1)
Description:
EBI_100271
Residue:
490
  
Inhibitor
Name:
BDBM87341
Synonyms:
3-[3-(4-tert-Butyl-phenyl)-[1,2,4]oxadiazol-5-yl]-N-pyridin-3-yl-propionamide 3-[3-(4-tert-butylphenyl)-1,2,4-oxadiazol-5-yl]-N-(3-pyridyl)propionamide 3-[3-(4-tert-butylphenyl)-1,2,4-oxadiazol-5-yl]-N-pyridin-3-ylpropanamide SMR000612927 | cid_1991339
Type:
Small organic molecule
Emp. Form.:
C20H22N4O2
Mol. Mass.:
350.4143
SMILES:
CC(C)(C)c1ccc(cc1)-c1noc(CCC(=O)Nc2cccnc2)n1
: