Target
Tegument protein VP16
Ligand
BDBM87347
Substrate
Meas. Tech.
Counterscreen for inhibitors of the Steroid Receptor Coactivator 3 (SRC3; NCOA3)
IC50
8517±n/a nM
Citation
 PubChem, PC Counterscreen for inhibitors of the Steroid Receptor Coactivator 3 (SRC3; NCOA3): Luminescence-based cell-based high throughput dose response assay to identify inhibitors of the Herpes Virus Virion Protein 16 (VP16) PubChem Bioassay (2012)[AID] 
Target
Name:
Tegument protein VP16
Synonyms:
Alpha trans-inducing protein (VP16) transactivating tegument protein VP16
Type:
PROTEIN
Mol. Mass.:
54325.13
Organism:
Human herpesvirus 1 (strain 17) (HHV-1) (Human herpes simplex virus1)
Description:
EBI_100271
Residue:
490
  
Inhibitor
Name:
BDBM87347
Synonyms:
2-chloranyl-N-[(E)-[phenyl(pyridin-2-yl)methylidene]amino]benzamide 2-chloro-N-[(E)-[phenyl(2-pyridinyl)methylidene]amino]benzamide 2-chloro-N-[(E)-[phenyl(pyridin-2-yl)methylidene]amino]benzamide SMR000673314 | cid_5411796
Type:
Small organic molecule
Emp. Form.:
C19H14ClN3O
Mol. Mass.:
335.787
SMILES:
Clc1ccccc1C(=O)N\N=C(/c1ccccc1)c1ccccn1
: