Target
Tegument protein VP16
Ligand
BDBM87354
Substrate
Meas. Tech.
Counterscreen for inhibitors of the Steroid Receptor Coactivator 3 (SRC3; NCOA3)
IC50
>35865±n/a nM
Citation
 PubChem, PC Counterscreen for inhibitors of the Steroid Receptor Coactivator 3 (SRC3; NCOA3): Luminescence-based cell-based high throughput dose response assay to identify inhibitors of the Herpes Virus Virion Protein 16 (VP16) PubChem Bioassay (2012)[AID] 
Target
Name:
Tegument protein VP16
Synonyms:
Alpha trans-inducing protein (VP16) transactivating tegument protein VP16
Type:
PROTEIN
Mol. Mass.:
54325.13
Organism:
Human herpesvirus 1 (strain 17) (HHV-1) (Human herpes simplex virus1)
Description:
EBI_100271
Residue:
490
  
Inhibitor
Name:
BDBM87354
Synonyms:
6-(3,5-dimethyl-1,2-oxazol-4-yl)-N-[(3-methoxyphenyl)methyl]quinazolin-4-amine MLS002264433 [6-(3,5-dimethylisoxazol-4-yl)quinazolin-4-yl]-m-anisyl-amine | cid_17757075
Type:
Small organic molecule
Emp. Form.:
C21H20N4O2
Mol. Mass.:
360.4091
SMILES:
COc1cccc(CNc2ncnc3ccc(cc23)-c2c(C)noc2C)c1
: