Target
Nuclear receptor coactivator 1
Ligand
BDBM37106
Substrate
Meas. Tech.
Counterscreen for inhibitors of the Steroid Receptor Coactivator 3 (SRC3; NCOA3)
IC50
8124±n/a nM
Citation
 PubChem, PC Counterscreen for inhibitors of the Steroid Receptor Coactivator 3 (SRC3; NCOA3): Luminescence-based cell-based high throughput dose response assay to identify inhibitors of the Steroid Receptor Coactivator 1 (SRC1; NCOA1) PubChem Bioassay (2012)[AID] 
Target
Name:
Nuclear receptor coactivator 1
Synonyms:
BHLHE74 NCOA1 NCoA-1 Protein Hin-2 Renal carcinoma antigen NY-REN-52 SRC1 nuclear receptor coactivator 1 isoform 1
Type:
PROTEIN
Mol. Mass.:
156749.34
Organism:
Homo sapiens (Human)
Description:
ChEMBL_759690
Residue:
1441
  
Inhibitor
Name:
BDBM37106
Synonyms:
5-hydroxy-1-(4-methoxyphenyl)-2-methyl-3-indolecarboxylic acid methyl ester MLS000051536 cid_1508818 methyl 5-hydroxy-1-(4-methoxyphenyl)-2-methyl-1H-indole-3-carboxylate | methyl 5-hydroxy-1-(4-methoxyphenyl)-2-methylindole-3-carboxylate
Type:
Small organic molecule
Emp. Form.:
C18H17NO4
Mol. Mass.:
311.3319
SMILES:
COC(=O)c1c(C)n(-c2ccc(OC)cc2)c2ccc(O)cc12
: