Target
Nuclear receptor coactivator 1
Ligand
BDBM87264
Substrate
Meas. Tech.
Counterscreen for inhibitors of the Steroid Receptor Coactivator 3 (SRC3; NCOA3)
IC50
11624±n/a nM
Citation
 PubChem, PC Counterscreen for inhibitors of the Steroid Receptor Coactivator 3 (SRC3; NCOA3): Luminescence-based cell-based high throughput dose response assay to identify inhibitors of the Steroid Receptor Coactivator 1 (SRC1; NCOA1) PubChem Bioassay (2012)[AID] 
Target
Name:
Nuclear receptor coactivator 1
Synonyms:
BHLHE74 NCOA1 NCoA-1 Protein Hin-2 Renal carcinoma antigen NY-REN-52 SRC1 nuclear receptor coactivator 1 isoform 1
Type:
PROTEIN
Mol. Mass.:
156749.34
Organism:
Homo sapiens (Human)
Description:
ChEMBL_759690
Residue:
1441
  
Inhibitor
Name:
BDBM87264
Synonyms:
1-[3-(3-methylbut-2-enyl)-4-oxidanyl-phenyl]propan-1-one 1-[4-hydroxy-3-(3-methylbut-2-enyl)phenyl]-1-propanone MLS000541220 cid_902152
Type:
Small organic molecule
Emp. Form.:
C14H18O2
Mol. Mass.:
218.2915
SMILES:
[#6]-[#6]-[#6](=O)-c1ccc(-[#8])c(-[#6]\[#6]=[#6](\[#6])-[#6])c1
: