Target
Nuclear receptor coactivator 1
Ligand
BDBM87270
Substrate
Meas. Tech.
Counterscreen for inhibitors of the Steroid Receptor Coactivator 3 (SRC3; NCOA3)
IC50
14402±n/a nM
Citation
 PubChem, PC Counterscreen for inhibitors of the Steroid Receptor Coactivator 3 (SRC3; NCOA3): Luminescence-based cell-based high throughput dose response assay to identify inhibitors of the Steroid Receptor Coactivator 1 (SRC1; NCOA1) PubChem Bioassay (2012)[AID] 
Target
Name:
Nuclear receptor coactivator 1
Synonyms:
BHLHE74 NCOA1 NCoA-1 Protein Hin-2 Renal carcinoma antigen NY-REN-52 SRC1 nuclear receptor coactivator 1 isoform 1
Type:
PROTEIN
Mol. Mass.:
156749.34
Organism:
Homo sapiens (Human)
Description:
ChEMBL_759690
Residue:
1441
  
Inhibitor
Name:
BDBM87270
Synonyms:
2-chloranyl-5-nitro-N-(2-phenoxyphenyl)benzamide MLS000578252 cid_1222721
Type:
Small organic molecule
Emp. Form.:
C19H13ClN2O4
Mol. Mass.:
368.771
SMILES:
[O-][N+](=O)c1ccc(Cl)c(c1)C(=O)Nc1ccccc1Oc1ccccc1
: