Target
Nuclear receptor coactivator 1
Ligand
BDBM87271
Substrate
Meas. Tech.
Counterscreen for inhibitors of the Steroid Receptor Coactivator 3 (SRC3; NCOA3)
IC50
41661±n/a nM
Citation
 PubChem, PC Counterscreen for inhibitors of the Steroid Receptor Coactivator 3 (SRC3; NCOA3): Luminescence-based cell-based high throughput dose response assay to identify inhibitors of the Steroid Receptor Coactivator 1 (SRC1; NCOA1) PubChem Bioassay (2012)[AID] 
Target
Name:
Nuclear receptor coactivator 1
Synonyms:
BHLHE74 NCOA1 NCoA-1 Protein Hin-2 Renal carcinoma antigen NY-REN-52 SRC1 nuclear receptor coactivator 1 isoform 1
Type:
PROTEIN
Mol. Mass.:
156749.34
Organism:
Homo sapiens (Human)
Description:
ChEMBL_759690
Residue:
1441
  
Inhibitor
Name:
BDBM87271
Synonyms:
3-hydroxy-2-naphthalenecarbohydrazide 3-oxidanylnaphthalene-2-carbohydrazide SMR000207372 | cid_72699
Type:
Small organic molecule
Emp. Form.:
C11H10N2O2
Mol. Mass.:
202.2093
SMILES:
NNC(=O)c1cc2ccccc2cc1O
: