Target
Nuclear receptor coactivator 1
Ligand
BDBM70759
Substrate
Meas. Tech.
Counterscreen for inhibitors of the Steroid Receptor Coactivator 3 (SRC3; NCOA3)
IC50
11602±n/a nM
Citation
 PubChem, PC Counterscreen for inhibitors of the Steroid Receptor Coactivator 3 (SRC3; NCOA3): Luminescence-based cell-based high throughput dose response assay to identify inhibitors of the Steroid Receptor Coactivator 1 (SRC1; NCOA1) PubChem Bioassay (2012)[AID] 
Target
Name:
Nuclear receptor coactivator 1
Synonyms:
BHLHE74 NCOA1 NCoA-1 Protein Hin-2 Renal carcinoma antigen NY-REN-52 SRC1 nuclear receptor coactivator 1 isoform 1
Type:
PROTEIN
Mol. Mass.:
156749.34
Organism:
Homo sapiens (Human)
Description:
ChEMBL_759690
Residue:
1441
  
Inhibitor
Name:
BDBM70759
Synonyms:
2-(4-chloro-N-(2-chloro-1-oxoethyl)anilino)-N-cyclohexyl-2-(4-methoxyphenyl)acetamide 2-[(chloroacetyl)(4-chlorophenyl)amino]-N-cyclohexyl-2-(4-methoxyphenyl)acetamide MLS000583962 cid_12004950
Type:
Small organic molecule
Emp. Form.:
C23H26Cl2N2O3
Mol. Mass.:
449.37
SMILES:
COc1ccc(cc1)C(N(C(=O)CCl)c1ccc(Cl)cc1)C(=O)NC1CCCCC1
: