Target
Nuclear receptor coactivator 1
Ligand
BDBM54258
Substrate
Meas. Tech.
Counterscreen for inhibitors of the Steroid Receptor Coactivator 3 (SRC3; NCOA3)
IC50
>35855±n/a nM
Citation
 PubChem, PC Counterscreen for inhibitors of the Steroid Receptor Coactivator 3 (SRC3; NCOA3): Luminescence-based cell-based high throughput dose response assay to identify inhibitors of the Steroid Receptor Coactivator 1 (SRC1; NCOA1) PubChem Bioassay (2012)[AID] 
Target
Name:
Nuclear receptor coactivator 1
Synonyms:
BHLHE74 NCOA1 NCoA-1 Protein Hin-2 Renal carcinoma antigen NY-REN-52 SRC1 nuclear receptor coactivator 1 isoform 1
Type:
PROTEIN
Mol. Mass.:
156749.34
Organism:
Homo sapiens (Human)
Description:
ChEMBL_759690
Residue:
1441
  
Inhibitor
Name:
BDBM54258
Synonyms:
2-chloranyl-1-[4-[(3-methylphenyl)methyl]piperazin-1-yl]ethanone 2-chloro-1-[4-[(3-methylphenyl)methyl]-1-piperazinyl]ethanone MLS000336096 cid_2454965
Type:
Small organic molecule
Emp. Form.:
C14H19ClN2O
Mol. Mass.:
266.766
SMILES:
Cc1cccc(CN2CCN(CC2)C(=O)CCl)c1
: