Target
Nuclear receptor coactivator 1
Ligand
BDBM51185
Substrate
Meas. Tech.
Counterscreen for inhibitors of the Steroid Receptor Coactivator 3 (SRC3; NCOA3)
IC50
>35904±n/a nM
Citation
 PubChem, PC Counterscreen for inhibitors of the Steroid Receptor Coactivator 3 (SRC3; NCOA3): Luminescence-based cell-based high throughput dose response assay to identify inhibitors of the Steroid Receptor Coactivator 1 (SRC1; NCOA1) PubChem Bioassay (2012)[AID] 
Target
Name:
Nuclear receptor coactivator 1
Synonyms:
BHLHE74 NCOA1 NCoA-1 Protein Hin-2 Renal carcinoma antigen NY-REN-52 SRC1 nuclear receptor coactivator 1 isoform 1
Type:
PROTEIN
Mol. Mass.:
156749.34
Organism:
Homo sapiens (Human)
Description:
ChEMBL_759690
Residue:
1441
  
Inhibitor
Name:
BDBM51185
Synonyms:
1-[4-(1,2,3,4-tetrahydroacridin-9-ylamino)phenyl]ethanone SMR000309704 | cid_394839
Type:
Small organic molecule
Emp. Form.:
C21H20N2O
Mol. Mass.:
316.3963
SMILES:
CC(=O)c1ccc(Nc2c3CCCCc3nc3ccccc23)cc1
: