Target
Nuclear receptor coactivator 1
Ligand
BDBM68129
Substrate
Meas. Tech.
Counterscreen for inhibitors of the Steroid Receptor Coactivator 3 (SRC3; NCOA3)
IC50
13797±n/a nM
Citation
 PubChem, PC Counterscreen for inhibitors of the Steroid Receptor Coactivator 3 (SRC3; NCOA3): Luminescence-based cell-based high throughput dose response assay to identify inhibitors of the Steroid Receptor Coactivator 1 (SRC1; NCOA1) PubChem Bioassay (2012)[AID] 
Target
Name:
Nuclear receptor coactivator 1
Synonyms:
BHLHE74 NCOA1 NCoA-1 Protein Hin-2 Renal carcinoma antigen NY-REN-52 SRC1 nuclear receptor coactivator 1 isoform 1
Type:
PROTEIN
Mol. Mass.:
156749.34
Organism:
Homo sapiens (Human)
Description:
ChEMBL_759690
Residue:
1441
  
Inhibitor
Name:
BDBM68129
Synonyms:
5-(4-chlorophenyl)sulfonyl-N-propyl-1,2,3-thiadiazole-4-carboxamide 5-(4-chlorophenyl)sulfonyl-N-propyl-thiadiazole-4-carboxamide 5-[(4-chlorophenyl)sulfonyl]-N-propyl-1,2,3-thiadiazole-4-carboxamide SMR000334564 | cid_4296505
Type:
Small organic molecule
Emp. Form.:
C12H12ClN3O3S2
Mol. Mass.:
345.825
SMILES:
CCCNC(=O)c1nnsc1S(=O)(=O)c1ccc(Cl)cc1
: