Target
Nuclear receptor coactivator 1
Ligand
BDBM87326
Substrate
Meas. Tech.
Counterscreen for inhibitors of the Steroid Receptor Coactivator 3 (SRC3; NCOA3)
IC50
20092±n/a nM
Citation
 PubChem, PC Counterscreen for inhibitors of the Steroid Receptor Coactivator 3 (SRC3; NCOA3): Luminescence-based cell-based high throughput dose response assay to identify inhibitors of the Steroid Receptor Coactivator 1 (SRC1; NCOA1) PubChem Bioassay (2012)[AID] 
Target
Name:
Nuclear receptor coactivator 1
Synonyms:
BHLHE74 NCOA1 NCoA-1 Protein Hin-2 Renal carcinoma antigen NY-REN-52 SRC1 nuclear receptor coactivator 1 isoform 1
Type:
PROTEIN
Mol. Mass.:
156749.34
Organism:
Homo sapiens (Human)
Description:
ChEMBL_759690
Residue:
1441
  
Inhibitor
Name:
BDBM87326
Synonyms:
1-[4-(7-chloranylquinolin-4-yl)piperazin-1-yl]propan-1-one 1-[4-(7-chloro-4-quinolyl)piperazino]propan-1-one 1-[4-(7-chloroquinolin-4-yl)piperazino]propan-1-one SMR000459715 | cid_2823727
Type:
Small organic molecule
Emp. Form.:
C16H18ClN3O
Mol. Mass.:
303.787
SMILES:
CCC(=O)N1CCN(CC1)c1ccnc2cc(Cl)ccc12
: