Target
Nuclear receptor coactivator 1
Ligand
BDBM87337
Substrate
Meas. Tech.
Counterscreen for inhibitors of the Steroid Receptor Coactivator 3 (SRC3; NCOA3)
IC50
9045±n/a nM
Citation
 PubChem, PC Counterscreen for inhibitors of the Steroid Receptor Coactivator 3 (SRC3; NCOA3): Luminescence-based cell-based high throughput dose response assay to identify inhibitors of the Steroid Receptor Coactivator 1 (SRC1; NCOA1) PubChem Bioassay (2012)[AID] 
Target
Name:
Nuclear receptor coactivator 1
Synonyms:
BHLHE74 NCOA1 NCoA-1 Protein Hin-2 Renal carcinoma antigen NY-REN-52 SRC1 nuclear receptor coactivator 1 isoform 1
Type:
PROTEIN
Mol. Mass.:
156749.34
Organism:
Homo sapiens (Human)
Description:
ChEMBL_759690
Residue:
1441
  
Inhibitor
Name:
BDBM87337
Synonyms:
4-[2-(2,2,6-trimethyl-8-oxidanylidene-3,4-dihydropyrano[3,2-g]chromen-7-yl)ethanoylamino]butanoic acid 4-[[2-(2,2,6-trimethyl-8-oxo-3,4-dihydropyrano[3,2-g]chromen-7-yl)acetyl]amino]butanoic acid MLS001201785 cid_8016512
Type:
Small organic molecule
Emp. Form.:
C21H25NO6
Mol. Mass.:
387.4263
SMILES:
Cc1c(CC(=O)NCCCC(O)=O)c(=O)oc2cc3OC(C)(C)CCc3cc12
: