Target
Nuclear receptor coactivator 1
Ligand
BDBM67666
Substrate
Meas. Tech.
Counterscreen for inhibitors of the Steroid Receptor Coactivator 3 (SRC3; NCOA3)
IC50
11873±n/a nM
Citation
 PubChem, PC Counterscreen for inhibitors of the Steroid Receptor Coactivator 3 (SRC3; NCOA3): Luminescence-based cell-based high throughput dose response assay to identify inhibitors of the Steroid Receptor Coactivator 1 (SRC1; NCOA1) PubChem Bioassay (2012)[AID] 
Target
Name:
Nuclear receptor coactivator 1
Synonyms:
BHLHE74 NCOA1 NCoA-1 Protein Hin-2 Renal carcinoma antigen NY-REN-52 SRC1 nuclear receptor coactivator 1 isoform 1
Type:
PROTEIN
Mol. Mass.:
156749.34
Organism:
Homo sapiens (Human)
Description:
ChEMBL_759690
Residue:
1441
  
Inhibitor
Name:
BDBM67666
Synonyms:
(E)-3-(dimethylamino)-1-(3-phenyl-2,1-benzoxazol-5-yl)-2-propen-1-one (E)-3-(dimethylamino)-1-(3-phenylanthranil-5-yl)prop-2-en-1-one MLS001166481 cid_1483761
Type:
Small organic molecule
Emp. Form.:
C18H16N2O2
Mol. Mass.:
292.3318
SMILES:
CN(C)\C=C\C(=O)c1ccc2noc(-c3ccccc3)c2c1
: