Target
Nuclear receptor coactivator 1
Ligand
BDBM72898
Substrate
Meas. Tech.
Counterscreen for inhibitors of the Steroid Receptor Coactivator 3 (SRC3; NCOA3)
IC50
>35865±n/a nM
Citation
 PubChem, PC Counterscreen for inhibitors of the Steroid Receptor Coactivator 3 (SRC3; NCOA3): Luminescence-based cell-based high throughput dose response assay to identify inhibitors of the Steroid Receptor Coactivator 1 (SRC1; NCOA1) PubChem Bioassay (2012)[AID] 
Target
Name:
Nuclear receptor coactivator 1
Synonyms:
BHLHE74 NCOA1 NCoA-1 Protein Hin-2 Renal carcinoma antigen NY-REN-52 SRC1 nuclear receptor coactivator 1 isoform 1
Type:
PROTEIN
Mol. Mass.:
156749.34
Organism:
Homo sapiens (Human)
Description:
ChEMBL_759690
Residue:
1441
  
Inhibitor
Name:
BDBM72898
Synonyms:
2,4,5,6-tetrachloro-N-(phenylmethyl)-3-pyridinecarboxamide MLS001202192 N-benzyl-2,4,5,6-tetrachloronicotinamide SMR000565083 | cid_628678
Type:
Small organic molecule
Emp. Form.:
C13H8Cl4N2O
Mol. Mass.:
350.027
SMILES:
Clc1nc(Cl)c(C(=O)NCc2ccccc2)c(Cl)c1Cl
: