Target
Nuclear receptor coactivator 1
Ligand
BDBM72918
Substrate
Meas. Tech.
Counterscreen for inhibitors of the Steroid Receptor Coactivator 3 (SRC3; NCOA3)
IC50
>35866±n/a nM
Citation
 PubChem, PC Counterscreen for inhibitors of the Steroid Receptor Coactivator 3 (SRC3; NCOA3): Luminescence-based cell-based high throughput dose response assay to identify inhibitors of the Steroid Receptor Coactivator 1 (SRC1; NCOA1) PubChem Bioassay (2012)[AID] 
Target
Name:
Nuclear receptor coactivator 1
Synonyms:
BHLHE74 NCOA1 NCoA-1 Protein Hin-2 Renal carcinoma antigen NY-REN-52 SRC1 nuclear receptor coactivator 1 isoform 1
Type:
PROTEIN
Mol. Mass.:
156749.34
Organism:
Homo sapiens (Human)
Description:
ChEMBL_759690
Residue:
1441
  
Inhibitor
Name:
BDBM72918
Synonyms:
(3E,5E)-1-benzyl-3,5-bis(3-hydroxy-4-methoxy-benzylidene)-4-piperidone (3E,5E)-3,5-bis[(3-hydroxy-4-methoxyphenyl)methylidene]-1-(phenylmethyl)-4-piperidinone MLS001173824 cid_16338356
Type:
Small organic molecule
Emp. Form.:
C28H27NO5
Mol. Mass.:
457.5177
SMILES:
COc1ccc(\C=C2/CN(Cc3ccccc3)C\C(=C/c3ccc(OC)c(O)c3)C2=O)cc1O
: