Target
Nuclear receptor coactivator 1
Ligand
BDBM87344
Substrate
Meas. Tech.
Counterscreen for inhibitors of the Steroid Receptor Coactivator 3 (SRC3; NCOA3)
IC50
10039±n/a nM
Citation
 PubChem, PC Counterscreen for inhibitors of the Steroid Receptor Coactivator 3 (SRC3; NCOA3): Luminescence-based cell-based high throughput dose response assay to identify inhibitors of the Steroid Receptor Coactivator 1 (SRC1; NCOA1) PubChem Bioassay (2012)[AID] 
Target
Name:
Nuclear receptor coactivator 1
Synonyms:
BHLHE74 NCOA1 NCoA-1 Protein Hin-2 Renal carcinoma antigen NY-REN-52 SRC1 nuclear receptor coactivator 1 isoform 1
Type:
PROTEIN
Mol. Mass.:
156749.34
Organism:
Homo sapiens (Human)
Description:
ChEMBL_759690
Residue:
1441
  
Inhibitor
Name:
BDBM87344
Synonyms:
4-[2-(4-chlorophenyl)ethylsulfamoyl]-1H-pyrrole-2-carboxylic acid methyl ester SMR000627577 methyl 4-[2-(4-chlorophenyl)ethylsulfamoyl]-1H-pyrrole-2-carboxylate
Type:
Small organic molecule
Emp. Form.:
C14H15ClN2O4S
Mol. Mass.:
342.798
SMILES:
COC(=O)c1cc(c[nH]1)S(=O)(=O)NCCc1ccc(Cl)cc1
: