Target
Tyrosine-protein kinase ABL1
Ligand
BDBM87421
Substrate
Meas. Tech.
TRFRET-based biochemical high throughput dose response assay for inhibitors of the interaction of the Ras and Rab interactor 1 protein (Rin1) and the c-abl oncogene 1
IC50
695.03±n/a nM
Citation
 PubChem, PC TRFRET-based biochemical high throughput dose response assay for inhibitors of the interaction of the Ras and Rab interactor 1 protein (Rin1) and the c-abl oncogene 1, non-receptor tyrosine kinase (Abl) PubChem Bioassay (2012)[AID] 
Target
Name:
Tyrosine-protein kinase ABL1
Synonyms:
ABL ABL1_HUMAN JTK7 Proto-oncogene tyrosine-protein kinase ABL1 Tyrosine-protein kinase ABL V-abl Abelson murine leukemia viral oncogene homolog 1 p150 | tyrosine-protein kinase ABL1 isoform a
Type:
Enzyme
Mol. Mass.:
122897.30
Organism:
Homo sapiens (Human)
Description:
P00519
Residue:
1130
  
Inhibitor
Name:
BDBM87421
Synonyms:
6-[5-[(2-hydroxyethylthio)methyl]-2-keto-4-imidazolin-4-yl]-6-keto-hexanoic acid ethyl ester MLS000521804 cid_2897807 ethyl 6-[5-(2-hydroxyethylsulfanylmethyl)-2-oxo-1,3-dihydroimidazol-4-yl]-6-oxohexanoate
Type:
Small organic molecule
Emp. Form.:
C14H22N2O5S
Mol. Mass.:
330.4
SMILES:
CCOC(=O)CCCCC(=O)c1[nH]c(=O)[nH]c1CSCCO
: