Target
Tyrosine-protein kinase ABL1
Ligand
BDBM87422
Substrate
Meas. Tech.
TRFRET-based biochemical high throughput dose response assay for inhibitors of the interaction of the Ras and Rab interactor 1 protein (Rin1) and the c-abl oncogene 1
IC50
20526±n/a nM
Citation
 PubChem, PC TRFRET-based biochemical high throughput dose response assay for inhibitors of the interaction of the Ras and Rab interactor 1 protein (Rin1) and the c-abl oncogene 1, non-receptor tyrosine kinase (Abl) PubChem Bioassay (2012)[AID] 
Target
Name:
Tyrosine-protein kinase ABL1
Synonyms:
ABL ABL1_HUMAN JTK7 Proto-oncogene tyrosine-protein kinase ABL1 Tyrosine-protein kinase ABL V-abl Abelson murine leukemia viral oncogene homolog 1 p150 | tyrosine-protein kinase ABL1 isoform a
Type:
Enzyme
Mol. Mass.:
122897.30
Organism:
Homo sapiens (Human)
Description:
P00519
Residue:
1130
  
Inhibitor
Name:
BDBM87422
Synonyms:
4-[4-(3-chlorophenyl)piperazin-1-yl]carbonyl-6,7-dimethoxy-2-methyl-isoquinolin-1-one 4-[4-(3-chlorophenyl)piperazine-1-carbonyl]-6,7-dimethoxy-2-methylisoquinolin-1-one MLS000519856 cid_9551494
Type:
Small organic molecule
Emp. Form.:
C23H24ClN3O4
Mol. Mass.:
441.907
SMILES:
COc1cc2c(cn(C)c(=O)c2cc1OC)C(=O)N1CCN(CC1)c1cccc(Cl)c1
: