Target
Tyrosine-protein kinase ABL1
Ligand
BDBM87438
Substrate
Meas. Tech.
TRFRET-based biochemical high throughput dose response assay for inhibitors of the interaction of the Ras and Rab interactor 1 protein (Rin1) and the c-abl oncogene 1
IC50
25288±n/a nM
Citation
 PubChem, PC TRFRET-based biochemical high throughput dose response assay for inhibitors of the interaction of the Ras and Rab interactor 1 protein (Rin1) and the c-abl oncogene 1, non-receptor tyrosine kinase (Abl) PubChem Bioassay (2012)[AID] 
Target
Name:
Tyrosine-protein kinase ABL1
Synonyms:
ABL ABL1_HUMAN JTK7 Proto-oncogene tyrosine-protein kinase ABL1 Tyrosine-protein kinase ABL V-abl Abelson murine leukemia viral oncogene homolog 1 p150 | tyrosine-protein kinase ABL1 isoform a
Type:
Enzyme
Mol. Mass.:
122897.30
Organism:
Homo sapiens (Human)
Description:
P00519
Residue:
1130
  
Inhibitor
Name:
BDBM87438
Synonyms:
4-[[2-[2-[(2-hydroxyethylamino)methyl]phenoxy]-1-oxoethyl]amino]benzoic acid ethyl ester MLS000664031 cid_2217398 ethyl 4-[[2-[2-[(2-hydroxyethylamino)methyl]phenoxy]acetyl]amino]benzoate | ethyl 4-{[(2-{[(2-hydroxyethyl)amino]methyl}phenoxy)acetyl]amino}benzoate
Type:
Small organic molecule
Emp. Form.:
C20H24N2O5
Mol. Mass.:
372.415
SMILES:
CCOC(=O)c1ccc(NC(=O)COc2ccccc2CNCCO)cc1
: