Target
Tyrosine-protein kinase ABL1
Ligand
BDBM87439
Substrate
Meas. Tech.
TRFRET-based biochemical high throughput dose response assay for inhibitors of the interaction of the Ras and Rab interactor 1 protein (Rin1) and the c-abl oncogene 1
IC50
11928±n/a nM
Citation
 PubChem, PC TRFRET-based biochemical high throughput dose response assay for inhibitors of the interaction of the Ras and Rab interactor 1 protein (Rin1) and the c-abl oncogene 1, non-receptor tyrosine kinase (Abl) PubChem Bioassay (2012)[AID] 
Target
Name:
Tyrosine-protein kinase ABL1
Synonyms:
ABL ABL1_HUMAN JTK7 Proto-oncogene tyrosine-protein kinase ABL1 Tyrosine-protein kinase ABL V-abl Abelson murine leukemia viral oncogene homolog 1 p150 | tyrosine-protein kinase ABL1 isoform a
Type:
Enzyme
Mol. Mass.:
122897.30
Organism:
Homo sapiens (Human)
Description:
P00519
Residue:
1130
  
Inhibitor
Name:
BDBM87439
Synonyms:
3-(3-carbazol-9-yl-2-hydroxy-propyl)hydantoin 3-(3-carbazol-9-yl-2-oxidanyl-propyl)imidazolidine-2,4-dione 3-[3-(9H-carbazol-9-yl)-2-hydroxypropyl]-2,4-imidazolidinedione SMR000292452 | cid_2940983
Type:
Small organic molecule
Emp. Form.:
C18H17N3O3
Mol. Mass.:
323.3459
SMILES:
OC(CN1C(=O)CNC1=O)Cn1c2ccccc2c2ccccc12
: