Target
Tyrosine-protein kinase ABL1
Ligand
BDBM87441
Substrate
Meas. Tech.
TRFRET-based biochemical high throughput dose response assay for inhibitors of the interaction of the Ras and Rab interactor 1 protein (Rin1) and the c-abl oncogene 1
IC50
34105±n/a nM
Citation
 PubChem, PC TRFRET-based biochemical high throughput dose response assay for inhibitors of the interaction of the Ras and Rab interactor 1 protein (Rin1) and the c-abl oncogene 1, non-receptor tyrosine kinase (Abl) PubChem Bioassay (2012)[AID] 
Target
Name:
Tyrosine-protein kinase ABL1
Synonyms:
ABL ABL1_HUMAN JTK7 Proto-oncogene tyrosine-protein kinase ABL1 Tyrosine-protein kinase ABL V-abl Abelson murine leukemia viral oncogene homolog 1 p150 | tyrosine-protein kinase ABL1 isoform a
Type:
Enzyme
Mol. Mass.:
122897.30
Organism:
Homo sapiens (Human)
Description:
P00519
Residue:
1130
  
Inhibitor
Name:
BDBM87441
Synonyms:
(3aS,5S,9aS)-2-(2-methylbenzyl)-5-piazthiol-5-yl-3a,4,5,7,8,9-hexahydro-3H-pyrrolo[3,4-h]pyrrolizin-1-one (3aS,5S,9aS)-5-(2,1,3-benzothiadiazol-5-yl)-2-[(2-methylphenyl)methyl]-3a,4,5,7,8,9-hexahydro-3H-pyrrolo[3,4-h]pyrrolizin-1-one SMR000316220 | cid_16191136
Type:
Small organic molecule
Emp. Form.:
C23H24N4OS
Mol. Mass.:
404.528
SMILES:
Cc1ccccc1CN1C[C@@H]2C[C@H](N3CCC[C@@]23C1=O)c1ccc2nsnc2c1
: