Target
Tyrosine-protein kinase ABL1
Ligand
BDBM87443
Substrate
Meas. Tech.
TRFRET-based biochemical high throughput dose response assay for inhibitors of the interaction of the Ras and Rab interactor 1 protein (Rin1) and the c-abl oncogene 1
IC50
7811±n/a nM
Citation
 PubChem, PC TRFRET-based biochemical high throughput dose response assay for inhibitors of the interaction of the Ras and Rab interactor 1 protein (Rin1) and the c-abl oncogene 1, non-receptor tyrosine kinase (Abl) PubChem Bioassay (2012)[AID] 
Target
Name:
Tyrosine-protein kinase ABL1
Synonyms:
ABL ABL1_HUMAN JTK7 Proto-oncogene tyrosine-protein kinase ABL1 Tyrosine-protein kinase ABL V-abl Abelson murine leukemia viral oncogene homolog 1 p150 | tyrosine-protein kinase ABL1 isoform a
Type:
Enzyme
Mol. Mass.:
122897.30
Organism:
Homo sapiens (Human)
Description:
P00519
Residue:
1130
  
Inhibitor
Name:
BDBM87443
Synonyms:
4-[[4-[(4-carbethoxypiperazine-1-carbonyl)amino]phenyl]carbamoyl]piperazine-1-carboxylic acid ethyl ester MLS000712053 cid_1103613 ethyl 4-[[4-[(4-ethoxycarbonylpiperazine-1-carbonyl)amino]phenyl]carbamoyl]piperazine-1-carboxylate
Type:
Small organic molecule
Emp. Form.:
C22H32N6O6
Mol. Mass.:
476.5261
SMILES:
CCOC(=O)N1CCN(CC1)C(=O)Nc1ccc(NC(=O)N2CCN(CC2)C(=O)OCC)cc1
: