Target
Tyrosine-protein kinase ABL1
Ligand
BDBM50056938
Substrate
Meas. Tech.
TRFRET-based biochemical high throughput dose response assay for inhibitors of the interaction of the Ras and Rab interactor 1 protein (Rin1) and the c-abl oncogene 1
IC50
834.68±n/a nM
Citation
 PubChem, PC TRFRET-based biochemical high throughput dose response assay for inhibitors of the interaction of the Ras and Rab interactor 1 protein (Rin1) and the c-abl oncogene 1, non-receptor tyrosine kinase (Abl) PubChem Bioassay (2012)[AID] 
Target
Name:
Tyrosine-protein kinase ABL1
Synonyms:
ABL ABL1_HUMAN JTK7 Proto-oncogene tyrosine-protein kinase ABL1 Tyrosine-protein kinase ABL V-abl Abelson murine leukemia viral oncogene homolog 1 p150 | tyrosine-protein kinase ABL1 isoform a
Type:
Enzyme
Mol. Mass.:
122897.30
Organism:
Homo sapiens (Human)
Description:
P00519
Residue:
1130
  
Inhibitor
Name:
BDBM50056938
Synonyms:
2,6,7-Trihydroxy-9-methyl-xanthen-3-one NSC-66209 cid_72721
Type:
Small organic molecule
Emp. Form.:
C14H10O5
Mol. Mass.:
258.2262
SMILES:
Cc1c2cc(O)c(O)cc2oc2cc(=O)c(O)cc12
: