Target
Tyrosine-protein kinase ABL1
Ligand
BDBM87459
Substrate
Meas. Tech.
TRFRET-based biochemical high throughput dose response assay for inhibitors of the interaction of the Ras and Rab interactor 1 protein (Rin1) and the c-abl oncogene 1
IC50
66621±n/a nM
Citation
 PubChem, PC TRFRET-based biochemical high throughput dose response assay for inhibitors of the interaction of the Ras and Rab interactor 1 protein (Rin1) and the c-abl oncogene 1, non-receptor tyrosine kinase (Abl) PubChem Bioassay (2012)[AID] 
Target
Name:
Tyrosine-protein kinase ABL1
Synonyms:
ABL ABL1_HUMAN JTK7 Proto-oncogene tyrosine-protein kinase ABL1 Tyrosine-protein kinase ABL V-abl Abelson murine leukemia viral oncogene homolog 1 p150 | tyrosine-protein kinase ABL1 isoform a
Type:
Enzyme
Mol. Mass.:
122897.30
Organism:
Homo sapiens (Human)
Description:
P00519
Residue:
1130
  
Inhibitor
Name:
BDBM87459
Synonyms:
MLS000851174 N-[1-[(2R,5S)-5-(hydroxymethyl)oxolan-2-yl]-2-oxidanylidene-pyrimidin-4-yl]benzamide N-[2-keto-1-[(2R,5S)-5-methyloltetrahydrofuran-2-yl]pyrimidin-4-yl]benzamide SMR000457417 | cid_678696
Type:
Small organic molecule
Emp. Form.:
C16H17N3O4
Mol. Mass.:
315.3239
SMILES:
OC[C@@H]1CC[C@@H](O1)n1ccc(NC(=O)c2ccccc2)nc1=O
: