Target
Tyrosine-protein kinase ABL1
Ligand
BDBM87460
Substrate
Meas. Tech.
TRFRET-based biochemical high throughput dose response assay for inhibitors of the interaction of the Ras and Rab interactor 1 protein (Rin1) and the c-abl oncogene 1
IC50
14111±n/a nM
Citation
 PubChem, PC TRFRET-based biochemical high throughput dose response assay for inhibitors of the interaction of the Ras and Rab interactor 1 protein (Rin1) and the c-abl oncogene 1, non-receptor tyrosine kinase (Abl) PubChem Bioassay (2012)[AID] 
Target
Name:
Tyrosine-protein kinase ABL1
Synonyms:
ABL ABL1_HUMAN JTK7 Proto-oncogene tyrosine-protein kinase ABL1 Tyrosine-protein kinase ABL V-abl Abelson murine leukemia viral oncogene homolog 1 p150 | tyrosine-protein kinase ABL1 isoform a
Type:
Enzyme
Mol. Mass.:
122897.30
Organism:
Homo sapiens (Human)
Description:
P00519
Residue:
1130
  
Inhibitor
Name:
BDBM87460
Synonyms:
1-(1-keto-6,7-dimethoxy-2-methyl-isoquinoline-4-carbonyl)nipecotic acid ethyl ester MLS001065451 cid_3238687 ethyl 1-(6,7-dimethoxy-2-methyl-1-oxoisoquinoline-4-carbonyl)piperidine-3-carboxylate | ethyl 1-[(6,7-dimethoxy-2-methyl-1-oxo-1,2-dihydroisoquinolin-4-yl)carbonyl]piperidine-3-carboxylate
Type:
Small organic molecule
Emp. Form.:
C21H26N2O6
Mol. Mass.:
402.4409
SMILES:
CCOC(=O)C1CCCN(C1)C(=O)c1cn(C)c(=O)c2cc(OC)c(OC)cc12
: