Target
Tyrosine-protein kinase ABL1
Ligand
BDBM53187
Substrate
Meas. Tech.
TRFRET-based biochemical high throughput dose response assay for inhibitors of the interaction of the Ras and Rab interactor 1 protein (Rin1) and the c-abl oncogene 1
IC50
>73503±n/a nM
Citation
 PubChem, PC TRFRET-based biochemical high throughput dose response assay for inhibitors of the interaction of the Ras and Rab interactor 1 protein (Rin1) and the c-abl oncogene 1, non-receptor tyrosine kinase (Abl) PubChem Bioassay (2012)[AID] 
Target
Name:
Tyrosine-protein kinase ABL1
Synonyms:
ABL ABL1_HUMAN JTK7 Proto-oncogene tyrosine-protein kinase ABL1 Tyrosine-protein kinase ABL V-abl Abelson murine leukemia viral oncogene homolog 1 p150 | tyrosine-protein kinase ABL1 isoform a
Type:
Enzyme
Mol. Mass.:
122897.30
Organism:
Homo sapiens (Human)
Description:
P00519
Residue:
1130
  
Inhibitor
Name:
BDBM53187
Synonyms:
(4E)-2,3-bis(oxidanyl)-4-[(piperidin-1-ylamino)methylidene]cyclohexa-2,5-dien-1-one (4E)-2,3-dihydroxy-4-[(piperidin-1-ylamino)methylidene]cyclohexa-2,5-dien-1-one MLS001177377 cid_5820077
Type:
Small organic molecule
Emp. Form.:
C12H16N2O3
Mol. Mass.:
236.267
SMILES:
Oc1ccc(C=NN2CCCCC2)c(O)c1O
: