Target
Tyrosine-protein kinase ABL1
Ligand
BDBM87475
Substrate
Meas. Tech.
TRFRET-based biochemical high throughput dose response assay for inhibitors of the interaction of the Ras and Rab interactor 1 protein (Rin1) and the c-abl oncogene 1
IC50
6881±n/a nM
Citation
 PubChem, PC TRFRET-based biochemical high throughput dose response assay for inhibitors of the interaction of the Ras and Rab interactor 1 protein (Rin1) and the c-abl oncogene 1, non-receptor tyrosine kinase (Abl) PubChem Bioassay (2012)[AID] 
Target
Name:
Tyrosine-protein kinase ABL1
Synonyms:
ABL ABL1_HUMAN JTK7 Proto-oncogene tyrosine-protein kinase ABL1 Tyrosine-protein kinase ABL V-abl Abelson murine leukemia viral oncogene homolog 1 p150 | tyrosine-protein kinase ABL1 isoform a
Type:
Enzyme
Mol. Mass.:
122897.30
Organism:
Homo sapiens (Human)
Description:
P00519
Residue:
1130
  
Inhibitor
Name:
BDBM87475
Synonyms:
4-[5-[(2-methylsulfanylphenoxy)methyl]-1,2-oxazole-3-carbonyl]piperazin-2-one 4-[[5-[(2-methylsulfanylphenoxy)methyl]-1,2-oxazol-3-yl]carbonyl]piperazin-2-one MLS001073549 cid_24793301
Type:
Small organic molecule
Emp. Form.:
C16H17N3O4S
Mol. Mass.:
347.389
SMILES:
CSc1ccccc1OCc1cc(no1)C(=O)N1CCNC(=O)C1
: