Target
Tyrosine-protein kinase ABL1
Ligand
BDBM87489
Substrate
Meas. Tech.
TRFRET-based biochemical high throughput dose response assay for inhibitors of the interaction of the Ras and Rab interactor 1 protein (Rin1) and the c-abl oncogene 1
IC50
2484±n/a nM
Citation
 PubChem, PC TRFRET-based biochemical high throughput dose response assay for inhibitors of the interaction of the Ras and Rab interactor 1 protein (Rin1) and the c-abl oncogene 1, non-receptor tyrosine kinase (Abl) PubChem Bioassay (2012)[AID] 
Target
Name:
Tyrosine-protein kinase ABL1
Synonyms:
ABL ABL1_HUMAN JTK7 Proto-oncogene tyrosine-protein kinase ABL1 Tyrosine-protein kinase ABL V-abl Abelson murine leukemia viral oncogene homolog 1 p150 | tyrosine-protein kinase ABL1 isoform a
Type:
Enzyme
Mol. Mass.:
122897.30
Organism:
Homo sapiens (Human)
Description:
P00519
Residue:
1130
  
Inhibitor
Name:
BDBM87489
Synonyms:
2-(2-cyanophenyl)sulfanyl-N-[2-(furan-2-yl)-2-pyrrolidin-1-yl-ethyl]benzamide 2-[(2-cyanophenyl)thio]-N-[2-(2-furanyl)-2-(1-pyrrolidinyl)ethyl]benzamide MLS001080052 cid_16256020
Type:
Small organic molecule
Emp. Form.:
C24H23N3O2S
Mol. Mass.:
417.523
SMILES:
O=C(NCC(N1CCCC1)c1ccco1)c1ccccc1Sc1ccccc1C#N
: