Target
Tyrosine-protein kinase ABL1
Ligand
BDBM87492
Substrate
Meas. Tech.
TRFRET-based biochemical high throughput dose response assay for inhibitors of the interaction of the Ras and Rab interactor 1 protein (Rin1) and the c-abl oncogene 1
IC50
2032±n/a nM
Citation
 PubChem, PC TRFRET-based biochemical high throughput dose response assay for inhibitors of the interaction of the Ras and Rab interactor 1 protein (Rin1) and the c-abl oncogene 1, non-receptor tyrosine kinase (Abl) PubChem Bioassay (2012)[AID] 
Target
Name:
Tyrosine-protein kinase ABL1
Synonyms:
ABL ABL1_HUMAN JTK7 Proto-oncogene tyrosine-protein kinase ABL1 Tyrosine-protein kinase ABL V-abl Abelson murine leukemia viral oncogene homolog 1 p150 | tyrosine-protein kinase ABL1 isoform a
Type:
Enzyme
Mol. Mass.:
122897.30
Organism:
Homo sapiens (Human)
Description:
P00519
Residue:
1130
  
Inhibitor
Name:
BDBM87492
Synonyms:
MLS001080022 N-[2-(4-methoxyanilino)-2-oxoethyl]-N-methyl-2-[5-(4-morpholinylsulfonyl)-2-thiophenyl]acetamide N-[2-keto-2-(p-anisidino)ethyl]-N-methyl-2-(5-morpholinosulfonyl-2-thienyl)acetamide cid_16256016
Type:
Small organic molecule
Emp. Form.:
C20H25N3O6S2
Mol. Mass.:
467.559
SMILES:
COc1ccc(NC(=O)CN(C)C(=O)Cc2ccc(s2)S(=O)(=O)N2CCOCC2)cc1
: