Target
Tyrosine-protein kinase ABL1
Ligand
BDBM87523
Substrate
Meas. Tech.
TRFRET-based biochemical high throughput dose response assay for inhibitors of the interaction of the Ras and Rab interactor 1 protein (Rin1) and the c-abl oncogene 1
IC50
18942±n/a nM
Citation
 PubChem, PC TRFRET-based biochemical high throughput dose response assay for inhibitors of the interaction of the Ras and Rab interactor 1 protein (Rin1) and the c-abl oncogene 1, non-receptor tyrosine kinase (Abl) PubChem Bioassay (2012)[AID] 
Target
Name:
Tyrosine-protein kinase ABL1
Synonyms:
ABL ABL1_HUMAN JTK7 Proto-oncogene tyrosine-protein kinase ABL1 Tyrosine-protein kinase ABL V-abl Abelson murine leukemia viral oncogene homolog 1 p150 | tyrosine-protein kinase ABL1 isoform a
Type:
Enzyme
Mol. Mass.:
122897.30
Organism:
Homo sapiens (Human)
Description:
P00519
Residue:
1130
  
Inhibitor
Name:
BDBM87523
Synonyms:
1-(cyclohexanecarbonyl)-N-[3-[2-[4-[cyclopropyl(methyl)carbamoyl]anilino]-2-keto-ethyl]phenyl]isonipecotamide 1-[cyclohexyl(oxo)methyl]-N-[3-[2-[4-[[cyclopropyl(methyl)amino]-oxomethyl]anilino]-2-oxoethyl]phenyl]-4-piperidinecarboxamide MLS002698668 cid_44825576
Type:
Small organic molecule
Emp. Form.:
C32H40N4O4
Mol. Mass.:
544.6844
SMILES:
CN(C1CC1)C(=O)c1ccc(NC(=O)Cc2cccc(NC(=O)C3CCN(CC3)C(=O)C3CCCCC3)c2)cc1
: