Target
Tyrosine-protein kinase ABL1
Ligand
BDBM87524
Substrate
Meas. Tech.
TRFRET-based biochemical high throughput dose response assay for inhibitors of the interaction of the Ras and Rab interactor 1 protein (Rin1) and the c-abl oncogene 1
IC50
16489±n/a nM
Citation
 PubChem, PC TRFRET-based biochemical high throughput dose response assay for inhibitors of the interaction of the Ras and Rab interactor 1 protein (Rin1) and the c-abl oncogene 1, non-receptor tyrosine kinase (Abl) PubChem Bioassay (2012)[AID] 
Target
Name:
Tyrosine-protein kinase ABL1
Synonyms:
ABL ABL1_HUMAN JTK7 Proto-oncogene tyrosine-protein kinase ABL1 Tyrosine-protein kinase ABL V-abl Abelson murine leukemia viral oncogene homolog 1 p150 | tyrosine-protein kinase ABL1 isoform a
Type:
Enzyme
Mol. Mass.:
122897.30
Organism:
Homo sapiens (Human)
Description:
P00519
Residue:
1130
  
Inhibitor
Name:
BDBM87524
Synonyms:
1-(cyclobutanecarbonyl)-N-[4-[2-[4-(morpholine-4-carbonyl)anilino]-2-oxoethyl]phenyl]piperidine-4-carboxamide 1-[cyclobutyl(oxo)methyl]-N-[4-[2-[4-[4-morpholinyl(oxo)methyl]anilino]-2-oxoethyl]phenyl]-4-piperidinecarboxamide MLS002698722 cid_44825630
Type:
Small organic molecule
Emp. Form.:
C30H36N4O5
Mol. Mass.:
532.6306
SMILES:
O=C(Cc1ccc(NC(=O)C2CCN(CC2)C(=O)C2CCC2)cc1)Nc1ccc(cc1)C(=O)N1CCOCC1
: