Target
Tyrosine-protein kinase ABL1
Ligand
BDBM87529
Substrate
Meas. Tech.
TRFRET-based biochemical high throughput dose response assay for inhibitors of the interaction of the Ras and Rab interactor 1 protein (Rin1) and the c-abl oncogene 1
IC50
3906±n/a nM
Citation
 PubChem, PC TRFRET-based biochemical high throughput dose response assay for inhibitors of the interaction of the Ras and Rab interactor 1 protein (Rin1) and the c-abl oncogene 1, non-receptor tyrosine kinase (Abl) PubChem Bioassay (2012)[AID] 
Target
Name:
Tyrosine-protein kinase ABL1
Synonyms:
ABL ABL1_HUMAN JTK7 Proto-oncogene tyrosine-protein kinase ABL1 Tyrosine-protein kinase ABL V-abl Abelson murine leukemia viral oncogene homolog 1 p150 | tyrosine-protein kinase ABL1 isoform a
Type:
Enzyme
Mol. Mass.:
122897.30
Organism:
Homo sapiens (Human)
Description:
P00519
Residue:
1130
  
Inhibitor
Name:
BDBM87529
Synonyms:
1-benzoyl-N-[4-[2-[4-[[methyl(2-phenylethyl)amino]-oxomethyl]anilino]-2-oxoethyl]phenyl]-4-piperidinecarboxamide 1-benzoyl-N-[4-[2-keto-2-[4-[methyl(phenethyl)carbamoyl]anilino]ethyl]phenyl]isonipecotamide N-[4-[2-[[4-[methyl(2-phenylethyl)carbamoyl]phenyl]amino]-2-oxidanylidene-ethyl]phenyl]-1-(phenylcarbonyl)piperidine-4-carboxamide cid_44825707
Type:
Small organic molecule
Emp. Form.:
C37H38N4O4
Mol. Mass.:
602.722
SMILES:
CN(CCc1ccccc1)C(=O)c1ccc(NC(=O)Cc2ccc(NC(=O)C3CCN(CC3)C(=O)c3ccccc3)cc2)cc1
: