Target
Nuclear receptor coactivator 3
Ligand
BDBM3859
Substrate
Meas. Tech.
Counterscreen for inhibitors of the Steroid Receptor Coactivator 1 (SRC1; NCOA1)
IC50
2991±n/a nM
Citation
 PubChem, PC Counterscreen for inhibitors of the Steroid Receptor Coactivator 1 (SRC1; NCOA1): Luminescence-based cell-based high throughput dose response assay to identify inhibitors of the Steroid Receptor Coactivator 3 (SRC3; NCOA3) PubChem Bioassay (2012)[AID] 
Target
Name:
Nuclear receptor coactivator 3
Synonyms:
AIB1 NCOA3 RAC3 nuclear receptor coactivator 3 isoform a
Type:
Enzyme Catalytic Domain
Mol. Mass.:
155305.29
Organism:
Homo sapiens (Human)
Description:
Q9Y6Q9
Residue:
1424
  
Inhibitor
Name:
BDBM3859
Synonyms:
1-Phenylbenzimidazole deriv. 76 cid_652633
Type:
Small organic molecule
Emp. Form.:
C14H12N2O
Mol. Mass.:
224.2579
SMILES:
COc1ccc2ncn(-c3ccccc3)c2c1
: