Target
Nuclear receptor coactivator 3
Ligand
BDBM46455
Substrate
Meas. Tech.
Counterscreen for inhibitors of the Steroid Receptor Coactivator 1 (SRC1; NCOA1)
IC50
6857±n/a nM
Citation
 PubChem, PC Counterscreen for inhibitors of the Steroid Receptor Coactivator 1 (SRC1; NCOA1): Luminescence-based cell-based high throughput dose response assay to identify inhibitors of the Steroid Receptor Coactivator 3 (SRC3; NCOA3) PubChem Bioassay (2012)[AID] 
Target
Name:
Nuclear receptor coactivator 3
Synonyms:
AIB1 NCOA3 RAC3 nuclear receptor coactivator 3 isoform a
Type:
Enzyme Catalytic Domain
Mol. Mass.:
155305.29
Organism:
Homo sapiens (Human)
Description:
Q9Y6Q9
Residue:
1424
  
Inhibitor
Name:
BDBM46455
Synonyms:
3-bromanyl-5-ethoxy-4-methoxy-benzamide 3-bromo-5-ethoxy-4-methoxybenzamide SMR000114541 | cid_900806
Type:
Small organic molecule
Emp. Form.:
C10H12BrNO3
Mol. Mass.:
274.111
SMILES:
CCOc1cc(cc(Br)c1OC)C(N)=O
: