Target
Nuclear receptor coactivator 3
Ligand
BDBM4391
Substrate
Meas. Tech.
Counterscreen for inhibitors of the Steroid Receptor Coactivator 1 (SRC1; NCOA1)
IC50
>3986±n/a nM
Citation
 PubChem, PC Counterscreen for inhibitors of the Steroid Receptor Coactivator 1 (SRC1; NCOA1): Luminescence-based cell-based high throughput dose response assay to identify inhibitors of the Steroid Receptor Coactivator 3 (SRC3; NCOA3) PubChem Bioassay (2012)[AID] 
Target
Name:
Nuclear receptor coactivator 3
Synonyms:
AIB1 NCOA3 RAC3 nuclear receptor coactivator 3 isoform a
Type:
Enzyme Catalytic Domain
Mol. Mass.:
155305.29
Organism:
Homo sapiens (Human)
Description:
Q9Y6Q9
Residue:
1424
  
Inhibitor
Name:
BDBM4391
Synonyms:
cid_2928869
Type:
Emp. Form.:
C26H27N3O5S
Mol. Mass.:
493.575
SMILES:
CN(c1ccc(cc1)C(=O)N1CCN(Cc2ccc3OCOc3c2)CC1)S(=O)(=O)c1ccccc1
: