Target
Nuclear receptor coactivator 3
Ligand
BDBM67919
Substrate
Meas. Tech.
Counterscreen for inhibitors of the Steroid Receptor Coactivator 1 (SRC1; NCOA1)
IC50
1386±n/a nM
Citation
 PubChem, PC Counterscreen for inhibitors of the Steroid Receptor Coactivator 1 (SRC1; NCOA1): Luminescence-based cell-based high throughput dose response assay to identify inhibitors of the Steroid Receptor Coactivator 3 (SRC3; NCOA3) PubChem Bioassay (2012)[AID] 
Target
Name:
Nuclear receptor coactivator 3
Synonyms:
AIB1 NCOA3 RAC3 nuclear receptor coactivator 3 isoform a
Type:
Enzyme Catalytic Domain
Mol. Mass.:
155305.29
Organism:
Homo sapiens (Human)
Description:
Q9Y6Q9
Residue:
1424
  
Inhibitor
Name:
BDBM67919
Synonyms:
1-[4-(2,4-Dichloro-benzyloxy)-phenyl]-3-phenyl-thiourea 1-[4-[(2,4-dichlorophenyl)methoxy]phenyl]-3-phenyl-thiourea MLS000555361 cid_1143231
Type:
Small organic molecule
Emp. Form.:
C20H16Cl2N2OS
Mol. Mass.:
403.325
SMILES:
Clc1ccc(COc2ccc(NC(=S)Nc3ccccc3)cc2)c(Cl)c1
: