Target
Nuclear receptor coactivator 3
Ligand
BDBM87275
Substrate
Meas. Tech.
Counterscreen for inhibitors of the Steroid Receptor Coactivator 1 (SRC1; NCOA1)
IC50
3755±n/a nM
Citation
 PubChem, PC Counterscreen for inhibitors of the Steroid Receptor Coactivator 1 (SRC1; NCOA1): Luminescence-based cell-based high throughput dose response assay to identify inhibitors of the Steroid Receptor Coactivator 3 (SRC3; NCOA3) PubChem Bioassay (2012)[AID] 
Target
Name:
Nuclear receptor coactivator 3
Synonyms:
AIB1 NCOA3 RAC3 nuclear receptor coactivator 3 isoform a
Type:
Enzyme Catalytic Domain
Mol. Mass.:
155305.29
Organism:
Homo sapiens (Human)
Description:
Q9Y6Q9
Residue:
1424
  
Inhibitor
Name:
BDBM87275
Synonyms:
2-[(2-chloro-1-oxoethyl)-(2,2-dimethoxyethyl)amino]-N-cyclohexyl-2-(2-methylphenyl)acetamide 2-[(2-chloroacetyl)-(2,2-dimethoxyethyl)amino]-N-cyclohexyl-2-(o-tolyl)acetamide 2-[2-chloranylethanoyl(2,2-dimethoxyethyl)amino]-N-cyclohexyl-2-(2-methylphenyl)ethanamide SMR000206966 | cid_12004957
Type:
Small organic molecule
Emp. Form.:
C21H31ClN2O4
Mol. Mass.:
410.935
SMILES:
COC(CN(C(C(=O)NC1CCCCC1)c1ccccc1C)C(=O)CCl)OC
: