Target
Nuclear receptor coactivator 3
Ligand
BDBM63404
Substrate
Meas. Tech.
Counterscreen for inhibitors of the Steroid Receptor Coactivator 1 (SRC1; NCOA1)
IC50
>3988±n/a nM
Citation
 PubChem, PC Counterscreen for inhibitors of the Steroid Receptor Coactivator 1 (SRC1; NCOA1): Luminescence-based cell-based high throughput dose response assay to identify inhibitors of the Steroid Receptor Coactivator 3 (SRC3; NCOA3) PubChem Bioassay (2012)[AID] 
Target
Name:
Nuclear receptor coactivator 3
Synonyms:
AIB1 NCOA3 RAC3 nuclear receptor coactivator 3 isoform a
Type:
Enzyme Catalytic Domain
Mol. Mass.:
155305.29
Organism:
Homo sapiens (Human)
Description:
Q9Y6Q9
Residue:
1424
  
Inhibitor
Name:
BDBM63404
Synonyms:
2-chloranyl-1-[3-(furan-2-yl)-5-thiophen-2-yl-3,4-dihydropyrazol-2-yl]ethanone 2-chloro-1-[3-(furan-2-yl)-5-thiophen-2-yl-3,4-dihydropyrazol-2-yl]ethanone MLS000718831 cid_3162837
Type:
Small organic molecule
Emp. Form.:
C13H11ClN2O2S
Mol. Mass.:
294.757
SMILES:
ClCC(=O)N1N=C(CC1c1ccco1)c1cccs1
: