Target
Nuclear receptor coactivator 3
Ligand
BDBM63612
Substrate
Meas. Tech.
Counterscreen for inhibitors of the Steroid Receptor Coactivator 1 (SRC1; NCOA1)
IC50
7249±n/a nM
Citation
 PubChem, PC Counterscreen for inhibitors of the Steroid Receptor Coactivator 1 (SRC1; NCOA1): Luminescence-based cell-based high throughput dose response assay to identify inhibitors of the Steroid Receptor Coactivator 3 (SRC3; NCOA3) PubChem Bioassay (2012)[AID] 
Target
Name:
Nuclear receptor coactivator 3
Synonyms:
AIB1 NCOA3 RAC3 nuclear receptor coactivator 3 isoform a
Type:
Enzyme Catalytic Domain
Mol. Mass.:
155305.29
Organism:
Homo sapiens (Human)
Description:
Q9Y6Q9
Residue:
1424
  
Inhibitor
Name:
BDBM63612
Synonyms:
(2E)-2-[[4-(trifluoromethyl)anilino]methylene]-7,7a-dihydro-6H-pyrrolo[2,1-b]thiazole-3,5-quinone (2E)-2-[[4-(trifluoromethyl)anilino]methylidene]-7,7a-dihydro-6H-pyrrolo[2,1-b]thiazole-3,5-dione 2-{[4-(trifluoromethyl)anilino]methylene}dihydropyrrolo[2,1-b][1,3]thiazole-3,5(2H,6H)-dione SMR000334321 | cid_5821715
Type:
Small organic molecule
Emp. Form.:
C14H11F3N2O2S
Mol. Mass.:
328.31
SMILES:
FC(F)(F)c1ccc(NC=C2SC3CCC(=O)N3C2=O)cc1
: