Target
Nuclear receptor coactivator 3
Ligand
BDBM7004
Substrate
Meas. Tech.
Counterscreen for inhibitors of the Steroid Receptor Coactivator 1 (SRC1; NCOA1)
IC50
19854±n/a nM
Citation
 PubChem, PC Counterscreen for inhibitors of the Steroid Receptor Coactivator 1 (SRC1; NCOA1): Luminescence-based cell-based high throughput dose response assay to identify inhibitors of the Steroid Receptor Coactivator 3 (SRC3; NCOA3) PubChem Bioassay (2012)[AID] 
Target
Name:
Nuclear receptor coactivator 3
Synonyms:
AIB1 NCOA3 RAC3 nuclear receptor coactivator 3 isoform a
Type:
Enzyme Catalytic Domain
Mol. Mass.:
155305.29
Organism:
Homo sapiens (Human)
Description:
Q9Y6Q9
Residue:
1424
  
Inhibitor
Name:
BDBM7004
Synonyms:
cid_3265453
Type:
Emp. Form.:
C14H17N3O2S2
Mol. Mass.:
323.434
SMILES:
CN(C1CCS(=O)(=O)C1)c1ncnc2sc3CCCc3c12
: